{"text_format":"1","workbook":"xlsx","n_sheets":6,"sheets":["How to use this Tool","Product List","Budget Calculator","Pricing","Config","Sheet2"],"not_rendered":{"charts":0,"images":0,"macros":1,"external_links":0,"defined_names":2,"comments":0,"pivot_tables":0},"unopened":[],"bounds":{"document_bytes":16777216,"sheet_cells":100000,"rows_first":2000,"rows_last":500,"rows_between":2000,"halvings":0,"cell_chars":16384,"cell_head_chars":4096},"cells_cut":0,"cells_raw":0,"read":"whole","date_system":"1900"}

{"sheet":"How to use this Tool","index":0,"n_rows":18,"n_cols":4,"rows_kept":18,"cut":false,"hidden":false,"merged":[[17,2,17,19],[15,2,15,19],[14,1,14,19],[16,2,16,19],[1,2,1,9]]}
[null,"How to use the Budget Calculator Tool:"]
[null,null,"*Please Note: Only edit the light-yellow sections (cells) in this tool."]
[null,"1)","Using Tab “Product List”, search items needed and/or wanted by the Mission."]
[null,"2)","Using Tab “Product List”, select the items the Mission has confirmed for the order by selecting \"Yes\" in column E."]
[null,"3)","Using Tab “Product List” , once you have selected \"Yes\" for all items of interest, click the button titled \"Load Budget Calculator\", located at the top of the sheet."]
[null,"4)","Using Tab “Budget Calculator” add the following:"]
[null,null,null,"1) The total funding available for commodity procurement. (Cell H4)"]
[null,null,null,"1) The desired quantity of the product. (Column H)"]
[null,"5)","Using Tab “Budget Calculator” the following will be calculated:"]
[null,null,null,"1) The amount reserved for estimated freight and insurance costs. (Cell H6)"]
[null,null,null,"2) The estimated cost of the product. (Cell H5)"]
[null,null,null,"3) The proportion of the budget allocated to the product type. Please note the proportion allocated must add up to 100% or less of your commodity funding across all products. (Column L)"]
[]
[null,"Procurement Considerations"]
[null,"GHSC-PSM will compile procurement of the quantities requested from the budget calculator and source the items from international wholesalers, and suppliers. PSM will make a determination on availability and pricing that will ultimately determine the sources for each item. It should be noted that while GHSC-PSM will use existing contracts with suppliers to source the products, many of the items are in high demand globally and have not been sourced previously. The following notes on pricing, lead-times and shipping should be noted as the Mission prepares to order through GHSC-PSM:"]
[null,null,"Pricing: All listed product prices should be considered notional and for initial budgeting purposes only. Actual product prices may vary based on quotes received from international wholesalers and suppliers during sourcing."]
[null,null,"Shipping & Insurance: For estimation purposes, this tool assumes 30% of the cost of the goods for shipping and insurance. Freight estimates will depend on mode of transport, and weights and dimensions of the packaged products obtained following sourcing events. The ultimate quantity of each product procured may vary based on estimated freight and insurance costs, which may exceed the reserved 30%. The procurement team will endeavor to maintain the proportion of the budget allocated to each product type having taken into consideration freight and insurance costs."]
[null,null,"Product specifications: In order to maximize the impact of the limited central resources, products in the catalog are specifically described but based on availability substitutions may be made (e.g. for color, pack size).  Please be flexible with specifications and GHSC-PSM will ensure that where products have interdependencies related to equipment, these substitutions would only be made in consultation with the Mission."]

{"sheet":"Product List","index":1,"n_rows":337,"n_cols":5,"rows_kept":337,"cut":false,"hidden":false,"merged":[[1,1,1,3]]}
[]
[null,"COVID19 ARP Commodity Quantification & Budget Calculator"]
[null,"Version 9, Current as of June 2024"]
[]
[]
[null,"Category","PSM SKU Reference","Commodity Description","Select Product"]
[null,"Sanitation","104406XUZ09C","(COVID-19) Bag, Biohazard, Printed, Red,122 x 94 cm, Autoclavable, 2 mil, 100 Each"]
[null,"Sanitation","104407XUZ09C","(COVID-19) Bag, Biohazard, Printed, Red, 38 x 48 cm, Autoclavable, 2 mil, 100 Each"]
[null,"General Patient Care","104410XUZ01S","(COVID-19) Cardiac Monitor, Battery Backup, NIBP/NP/PR, Adult/Pediatric Modes, Attached Leads, 115 V, 1 Each"]
[null,"General Patient Care","104411XUZ01S","(COVID-19) Cardiac Monitor, Battery Backup, NIBP/NP/PR, Adult/Pediatric Modes, Attached Leads, 230 V, 1 Each"]
[null,"Respiratory Support","104412XUZ0AC","(COVID-19) Nasal Catheter, Flexible, 6-12 Lateral Eyes, Sterile, Single Use, 8 FR, 40 cm, 200 Each"]
[null,"Respiratory Support","104413XUZ01S","(COVID-19) Non-Rebreath O2 Mask w/ Reservoir, 2 m Tube, Non-Sterile, Single Use, Elastic Strap, Adult, 1 Each"]
[null,"Respiratory Support","104414XUZ01S","(COVID-19) Non-Rebreath O2 Mask w/ Reservoir, 2 m Tube, Non-Sterile, Single Use, Elastic Strap, Pediatric, 1 Each"]
[null,"Respiratory Support","104415XUZ01S","(COVID-19) Mask, Venturi, Oxygen Percentage Lock, w/ Tubing, Non-Sterile, Single Use, Adult, 1 Each"]
[null,"Respiratory Support","104416XUZ01S","(COVID-19) Mask, Venturi, Oxygen Percentage Lock, w/ Tubing, Non-Sterile, Single Use, Pediatric, 1 Each"]
[null,"Respiratory Support","104417XUZ0AC","(COVID-19) Nasal Cannula, Non-Sterile, Dual Prong, Flexible Anti-Kink Tubing, Adult , 200 Each"]
[null,"Respiratory Support","104418XUZ0AC","(COVID-19) Nasal Cannula, Non-Sterile, Dual Prong, Flexible Anti-Kink Tubing, Pediatric, 200 Each"]
[null,"Respiratory Support","104419XUZ0AC","(COVID-19) Nasal Cannula, Non-Sterile, Dual Prong, Flexible Anti-Kink Tubing, Neonatal, 200 Each"]
[null,"Respiratory Support","104420XUZ01S","(COVID-19) Nebulizer, Max 10 L/Min, Nebulisation Rate 0.1 L/min, 22 PSI, Disp. Mouthpiece, 220 V, 1 Each"]
[null,"Respiratory Support","104422XUZ01S","(COVID-19) O2 Concentrator, 1-10 L/Min Output, Adj. Flowmeter, 0.5 L/Min Interval, 6 mm Connector, 230 V, 1 Each"]
[null,"Respiratory Support","104423XUZ01S","(COVID-19) Pulse Oximeter, Finger Clip, Pediatric, Battery Powered, Resolution 1 bpm and 1% SpO2, 1 Each"]
[null,"Respiratory Support","104423XUZ09C","(COVID-19) Pulse Oximeter, Finger Clip, Pediatric, Battery Powered, Resolution 1 bpm and 1% SpO2, 100 Each"]
[null,"Respiratory Support","104424XUZ01S","(COVID-19) Pulse Oximeter, Finger Clip, Adult, Battery Powered, Resolution 1 bpm and 1% SpO2, 1 Each"]
[null,"Respiratory Support","104425XUZ01S","(COVID-19) Bag Valve Mask, Adult, 1475-2000 mL Vent. Bag, O2 Reservoir Bag, POP Valve, S/M/L Adult Mask, 1 Each"]
[null,"Respiratory Support","104426XUZ01S","(COVID-19) Bag Valve Mask, Pediatric, 500-700 mL Vent. Bag, O2 Reservoir Bag, POP Valve, Pediatric Mask, 1 Each"]
[null,"Respiratory Support","104427XUZ01S","(COVID-19) O2 Connector, Y-Type, Standard, 1 Each"]
[null,"Respiratory Support","104428XUZ01S","(COVID-19) O2 Connector, Male/Female, Standard, 1 Each"]
[null,"Respiratory Support","104429XUZ01S","(COVID-19) O2 Connector, Swivel, Standard, 1 Each"]
[null,"Respiratory Support","104431XUZ01S","(COVID-19) O2 Tubing, Standard Oxygen Connector, 2.1 m, 1 Each"]
[null,"Respiratory Support","104432XUZ01S","(COVID-19) O2 Tubing, Standard Oxygen Connector, 7.6 m, 1 Each"]
[null,"Respiratory Support","104433XUZ01S","(COVID-19) O2 Tubing, Standard Oxygen Connector, 15 m, 1 Each"]
[null,"Respiratory Support","104437XUZ01S","(COVID-19) Flowmeter, High Flow Oxygen, and Accessories for Ventilator, 1 Each"]
[null,"General Patient Care","104438XUZ0B7","(COVID-19) ECG Electrodes, Conductive, Skin-Adherent, Disposable, Snap-Type, 50 Each"]
[null,"General Patient Care","104439XUZ01S","(COVID-19) ECG Lead Wire, Snap Type, 5-Lead, AHA, 1 and 1.6 m, Reusable, 1 Each"]
[null,"General Patient Care","104584XUZ09C","(COVID-19) Alcohol Prep Pads, 70% Isopropyl Alcohol, Non-Sterile, 100 Each"]
[null,"Sanitation","104585XUZ01S","(COVID-19) Cadaver Bag, Adult, 250 x 120 cm, White, Linear Enfored PE, 300 microns, 6 Handles, 1 Each"]
[null,"Diagnostic Sample Collection","104603XUZ01S","(COVID-19) Sealing Film, 100 mm x 75 m, 1 Each"]
[null,"Personal Protective Equipment (PPE)","104605XUZ0DB","(COVID-19) Cuff Tape, White, 10 yd x 1 in, 144 Each"]
[null,"Personal Protective Equipment (PPE)","104612XUZ01S","(COVID-19) Apron, Heavy Duty, Non-Woven, Non-Medical, 1 Each"]
[null,"Personal Protective Equipment (PPE)","104613XUZ01S","(COVID-19) Apron, Plastic, 80 x 120 cm, Washable, PVC, Non-Medical, 1 Each"]
{"$rows_left_out":298}
{"sheet":"Budget Calculator","index":2,"n_rows":582,"n_cols":12,"rows_kept":582,"cut":false,"hidden":false,"merged":[[1,1,1,3],[4,11,5,11],[3,3,4,3],[5,3,6,3]]}
[]
[null,"COVID19 ARP Commodity Quantification & Budget Calculator"]
[null,"Version 9, Current as of June 2024"]
[null,null,null,"***Please note that all listed prices should be considered notional and for initial budgeting purposes only. The ultimate quantity of each product procured will vary based on final pricing received during sourcing.","Total Budget"]
[null,null,null,null,"Est. Commodity Cost",null,null,{"$f":"SUM(I:I)","v":0},null,null,null,"Proportion allocated must be less than or equal to 100%"]
[null,null,null,"***Please note that the ultimate quantity of each product procured may vary based on estimated freight and insurance costs, which may exceed the reserved 30%. The procurement team will endeavor to maintain the proportion of the budget allocated to each product type having taken into consideration freight and insurance costs.","Est. Freight + Insurance",null,null,{"$f":"H5*0.3","v":0}]
[null,null,null,null,"Funding Remaining",null,null,{"$f":"H4-H5-H6","v":0},null,null,null,{"$f":"\"Current Proportion Allocated: \" & ROUND(SUM(L10:L582)*100,2) & \"%\"","v":"Current Proportion Allocated: 0%"}]
[]
[null,"Category","PSM SKU Reference","Commodity Description","Estimated Price","Intended User",null,"Desired Quantity \n(of Pack Size listed in commodity description)","Est. Cost",null,null,"What proportion of your budget are you spending on this product type?"]
[null,null,null,null,{"$f":"_xlfn.IFNA(VLOOKUP(C10,Pricing!A:D,4,FALSE), \"\")","v":""},null,null,null,{"$f":"IFERROR(IF(H10=\"\", \"\", H10*E10), \"\")","v":""},null,null,{"$f":"IFERROR(I10/($H$4-$H$6), \"\")","v":""}]
[null,null,null,null,{"$f":"_xlfn.IFNA(VLOOKUP(C11,Pricing!A:D,4,FALSE), \"\")","v":""},null,null,null,{"$f":"IFERROR(IF(H11=\"\", \"\", H11*E11), \"\")","v":""},null,null,{"$f":"IFERROR(I11/($H$4-$H$6), \"\")","v":""}]
[null,null,null,null,{"$f":"_xlfn.IFNA(VLOOKUP(C12,Pricing!A:D,4,FALSE), \"\")","v":""},null,null,null,{"$f":"IFERROR(IF(H12=\"\", \"\", H12*E12), \"\")","v":""},null,null,""]
[null,null,null,null,{"$f":"_xlfn.IFNA(VLOOKUP(C13,Pricing!A:D,4,FALSE), \"\")","v":""},null,null,null,"",null,null,""]
[null,null,null,null,{"$f":"_xlfn.IFNA(VLOOKUP(C14,Pricing!A:D,4,FALSE), \"\")","v":""},null,null,null,"",null,null,""]
[null,null,null,null,{"$f":"_xlfn.IFNA(VLOOKUP(C15,Pricing!A:D,4,FALSE), \"\")","v":""},null,null,null,"",null,null,""]
[null,null,null,null,{"$f":"_xlfn.IFNA(VLOOKUP(C16,Pricing!A:D,4,FALSE), \"\")","v":""},null,null,null,"",null,null,""]
[null,null,null,null,{"$f":"_xlfn.IFNA(VLOOKUP(C17,Pricing!A:D,4,FALSE), \"\")","v":""},null,null,null,"",null,null,""]
[null,null,null,null,{"$f":"_xlfn.IFNA(VLOOKUP(C18,Pricing!A:D,4,FALSE), \"\")","v":""},null,null,null,"",null,null,""]
[null,null,null,null,{"$f":"_xlfn.IFNA(VLOOKUP(C19,Pricing!A:D,4,FALSE), \"\")","v":""},null,null,null,"",null,null,""]
[null,null,null,null,{"$f":"_xlfn.IFNA(VLOOKUP(C20,Pricing!A:D,4,FALSE), \"\")","v":""},null,null,null,"",null,null,""]
[null,null,null,null,{"$f":"_xlfn.IFNA(VLOOKUP(C21,Pricing!A:D,4,FALSE), \"\")","v":""},null,null,null,"",null,null,""]
[null,null,null,null,{"$f":"_xlfn.IFNA(VLOOKUP(C22,Pricing!A:D,4,FALSE), \"\")","v":""},null,null,null,"",null,null,""]
[null,null,null,null,{"$f":"_xlfn.IFNA(VLOOKUP(C23,Pricing!A:D,4,FALSE), \"\")","v":""},null,null,null,"",null,null,""]
[null,null,null,null,{"$f":"_xlfn.IFNA(VLOOKUP(C24,Pricing!A:D,4,FALSE), \"\")","v":""},null,null,null,"",null,null,""]
[null,null,null,null,{"$f":"_xlfn.IFNA(VLOOKUP(C25,Pricing!A:D,4,FALSE), \"\")","v":""},null,null,null,"",null,null,""]
[null,null,null,null,{"$f":"_xlfn.IFNA(VLOOKUP(C26,Pricing!A:D,4,FALSE), \"\")","v":""},null,null,null,"",null,null,""]
[null,null,null,null,{"$f":"_xlfn.IFNA(VLOOKUP(C27,Pricing!A:D,4,FALSE), \"\")","v":""},null,null,null,"",null,null,""]
[null,null,null,null,{"$f":"_xlfn.IFNA(VLOOKUP(C28,Pricing!A:D,4,FALSE), \"\")","v":""},null,null,null,"",null,null,""]
[null,null,null,null,{"$f":"_xlfn.IFNA(VLOOKUP(C29,Pricing!A:D,4,FALSE), \"\")","v":""},null,null,null,"",null,null,""]
[null,null,null,null,{"$f":"_xlfn.IFNA(VLOOKUP(C30,Pricing!A:D,4,FALSE), \"\")","v":""},null,null,null,"",null,null,""]
[null,null,null,null,{"$f":"_xlfn.IFNA(VLOOKUP(C31,Pricing!A:D,4,FALSE), \"\")","v":""},null,null,null,"",null,null,""]
[null,null,null,null,{"$f":"_xlfn.IFNA(VLOOKUP(C32,Pricing!A:D,4,FALSE), \"\")","v":""},null,null,null,"",null,null,""]
[null,null,null,null,{"$f":"_xlfn.IFNA(VLOOKUP(C33,Pricing!A:D,4,FALSE), \"\")","v":""},null,null,null,"",null,null,""]
[null,null,null,null,{"$f":"_xlfn.IFNA(VLOOKUP(C34,Pricing!A:D,4,FALSE), \"\")","v":""},null,null,null,"",null,null,""]
[null,null,null,null,{"$f":"_xlfn.IFNA(VLOOKUP(C35,Pricing!A:D,4,FALSE), \"\")","v":""},null,null,null,"",null,null,""]
[null,null,null,null,{"$f":"_xlfn.IFNA(VLOOKUP(C36,Pricing!A:D,4,FALSE), \"\")","v":""},null,null,null,"",null,null,""]
[null,null,null,null,{"$f":"_xlfn.IFNA(VLOOKUP(C37,Pricing!A:D,4,FALSE), \"\")","v":""},null,null,null,"",null,null,""]
[null,null,null,null,{"$f":"_xlfn.IFNA(VLOOKUP(C38,Pricing!A:D,4,FALSE), \"\")","v":""},null,null,null,"",null,null,""]
[null,null,null,null,{"$f":"_xlfn.IFNA(VLOOKUP(C39,Pricing!A:D,4,FALSE), \"\")","v":""},null,null,null,"",null,null,""]
[null,null,null,null,{"$f":"_xlfn.IFNA(VLOOKUP(C40,Pricing!A:D,4,FALSE), \"\")","v":""},null,null,null,"",null,null,""]
{"$rows_left_out":543}
{"sheet":"Pricing","index":3,"n_rows":332,"n_cols":4,"rows_kept":332,"cut":false,"hidden":true,"merged":[]}
["PSM SKU Reference","Commodity Description",null,"Estimated Price"]
["104406XUZ09C","(COVID-19) Bag, Biohazard, Printed, Red,122 x 94 cm, Autoclavable, 2 mil, 100 Each",null,33.650600000000004]
["104407XUZ09C","(COVID-19) Bag, Biohazard, Printed, Red, 38 x 48 cm, Autoclavable, 2 mil, 100 Each",null,21.7]
["104410XUZ01S","(COVID-19) Cardiac Monitor, Battery Backup, NIBP/NP/PR, Adult/Pediatric Modes, Attached Leads, 115 V, 1 Each",null,946.68999999999994]
["104411XUZ01S","(COVID-19) Cardiac Monitor, Battery Backup, NIBP/NP/PR, Adult/Pediatric Modes, Attached Leads, 230 V, 1 Each",null,946.68999999999994]
["104412XUZ0AC","(COVID-19) Nasal Catheter, Flexible, 6-12 Lateral Eyes, Sterile, Single Use, 8 FR, 40 cm, 200 Each",null,40.520000000000003]
["104413XUZ01S","(COVID-19) Non-Rebreath O2 Mask w/ Reservoir, 2 m Tube, Non-Sterile, Single Use, Elastic Strap, Adult, 1 Each",null,1.52]
["104414XUZ01S","(COVID-19) Non-Rebreath O2 Mask w/ Reservoir, 2 m Tube, Non-Sterile, Single Use, Elastic Strap, Pediatric, 1 Each",null,1.52]
["104415XUZ01S","(COVID-19) Mask, Venturi, Oxygen Percentage Lock, w/ Tubing, Non-Sterile, Single Use, Adult, 1 Each",null,0.83419999999999994]
["104416XUZ01S","(COVID-19) Mask, Venturi, Oxygen Percentage Lock, w/ Tubing, Non-Sterile, Single Use, Pediatric, 1 Each",null,2.02]
["104417XUZ0AC","(COVID-19) Nasal Cannula, Non-Sterile, Dual Prong, Flexible Anti-Kink Tubing, Adult , 200 Each",null,56.6]
["104418XUZ0AC","(COVID-19) Nasal Cannula, Non-Sterile, Dual Prong, Flexible Anti-Kink Tubing, Pediatric, 200 Each",null,145.82000000000002]
["104419XUZ0AC","(COVID-19) Nasal Cannula, Non-Sterile, Dual Prong, Flexible Anti-Kink Tubing, Neonatal, 200 Each",null,63.914000000000001]
["104420XUZ01S","(COVID-19) Nebulizer, Max 10 L/Min, Nebulisation Rate 0.1 L/min, 22 PSI, Disp. Mouthpiece, 220 V, 1 Each",null,23.02]
["104422XUZ01S","(COVID-19) O2 Concentrator, 1-10 L/Min Output, Adj. Flowmeter, 0.5 L/Min Interval, 6 mm Connector, 230 V, 1 Each",null,995]
["104423XUZ01S","(COVID-19) Pulse Oximeter, Finger Clip, Pediatric, Battery Powered, Resolution 1 bpm and 1% SpO2, 1 Each",null,153.14000000000001]
["104423XUZ09C","(COVID-19) Pulse Oximeter, Finger Clip, Pediatric, Battery Powered, Resolution 1 bpm and 1% SpO2, 100 Each",null,915.02]
["104424XUZ01S","(COVID-19) Pulse Oximeter, Finger Clip, Adult, Battery Powered, Resolution 1 bpm and 1% SpO2, 1 Each",null,149.31]
["104425XUZ01S","(COVID-19) Bag Valve Mask, Adult, 1475-2000 mL Vent. Bag, O2 Reservoir Bag, POP Valve, S/M/L Adult Mask, 1 Each",null,45.220000000000006]
["104426XUZ01S","(COVID-19) Bag Valve Mask, Pediatric, 500-700 mL Vent. Bag, O2 Reservoir Bag, POP Valve, Pediatric Mask, 1 Each",null,12.07]
["104427XUZ01S","(COVID-19) O2 Connector, Y-Type, Standard, 1 Each",null,3.72]
["104428XUZ01S","(COVID-19) O2 Connector, Male/Female, Standard, 1 Each",null,3.02]
["104429XUZ01S","(COVID-19) O2 Connector, Swivel, Standard, 1 Each",null,3.9049759999999996]
["104431XUZ01S","(COVID-19) O2 Tubing, Standard Oxygen Connector, 2.1 m, 1 Each",null,0.42000000000000004]
["104432XUZ01S","(COVID-19) O2 Tubing, Standard Oxygen Connector, 7.6 m, 1 Each",null,1.62]
["104433XUZ01S","(COVID-19) O2 Tubing, Standard Oxygen Connector, 15 m, 1 Each",null,3.1249999999999996]
["104437XUZ01S","(COVID-19) Flowmeter, High Flow Oxygen, and Accessories for Ventilator, 1 Each",null,93.52]
["104438XUZ0B7","(COVID-19) ECG Electrodes, Conductive, Skin-Adherent, Disposable, Snap-Type, 50 Each",null,4.8499999999999996]
["104439XUZ01S","(COVID-19) ECG Lead Wire, Snap Type, 5-Lead, AHA, 1 and 1.6 m, Reusable, 1 Each",null,27.02]
["104584XUZ09C","(COVID-19) Alcohol Prep Pads, 70% Isopropyl Alcohol, Non-Sterile, 100 Each",null,0.82000000000000006]
["104585XUZ01S","(COVID-19) Cadaver Bag, Adult, 250 x 120 cm, White, Linear Enfored PE, 300 microns, 6 Handles, 1 Each",null,27.419999999999998]
["104603XUZ01S","(COVID-19) Sealing Film, 100 mm x 75 m, 1 Each",null,81.11999999999999]
["104605XUZ0DB","(COVID-19) Cuff Tape, White, 10 yd x 1 in, 144 Each",null,82.42]
["104612XUZ01S","(COVID-19) Apron, Heavy Duty, Non-Woven, Non-Medical, 1 Each",null,0.84799999999999998]
["104613XUZ01S","(COVID-19) Apron, Plastic, 80 x 120 cm, Washable, PVC, Non-Medical, 1 Each",null,2.72]
["104616XUZ0L9","(COVID-19) Eyewash Solution, Sterile, Isotonic, Nozzle Applicator, 8 oz",null,12.77]
["104617XUZ0HN","(COVID-19) Gloves, Heavy Duty, Medium, Rubber, Non-Medical, 1 Pair",null,0.91699999999999993]
["104618XUZ0B7","(COVID-19) Surgical Gown, Medium, Sterile, 50 Each",null,303.77]
["104618XUZ0HT","(COVID-19) Surgical Gown, Medium, Sterile, 56 Each",null,77.319999999999993]
["104618XUZ0HX","(COVID-19) Surgical Gown, Medium, Sterile, 40 Each",null,60.690000000000005]
{"$rows_left_out":293}
{"sheet":"Config","index":4,"n_rows":3,"n_cols":1,"rows_kept":3,"cut":false,"hidden":true,"merged":[]}
["Select Product Options"]
[]
["Yes"]

{"sheet":"Sheet2","index":5,"n_rows":3,"n_cols":2,"rows_kept":3,"cut":false,"hidden":true,"merged":[]}
[]
[null,"Implementing Partner"]
[null,"Beneficiary"]